{"text_format":"1","workbook":"xlsx","n_sheets":18,"sheets":["employees_inf","employees_formal","sales_informal","sales_formal","Table 1","Table 2","Table 3","ONLINE APPENDIX -- Tables","Value added and employment","Costs and Benefits Registering","Regression for Figure 5","ONLINE APPENDIX -- Data","Data Table 1","Data Table 3","Data Figures 1 -3","Data Figure 4","Data Figure 5","Data Figure 6"],"not_rendered":{"charts":0,"images":0,"macros":0,"external_links":0,"defined_names":34,"comments":0,"pivot_tables":0},"unopened":[],"bounds":{"document_bytes":16777216,"sheet_cells":100000,"rows_first":2000,"rows_last":500,"rows_between":2000,"halvings":0,"cell_chars":16384,"cell_head_chars":4096},"cells_cut":0,"cells_raw":0,"read":"whole","date_system":"1900"}

{"sheet":"employees_inf","index":0,"n_rows":32,"n_cols":4,"rows_kept":32,"cut":false,"hidden":true,"merged":[]}
["country","year","mgr_college","employees"]
["Afghanistan",2009,null,9.5957446808510642]
["Angola",2010,null,9.2183908045977017]
["Argentina",2010,null,1.5825242718446602]
["Bangladesh",2003,4.5685280114412308E-2,5.2385786802030454]
["Botswana",2010,null,2.6947368421052631]
["Brazil",2003,0.127976194024086,2.4215116279069768]
["Burkina Faso",2009,3.6036036908626556E-2,1.2252252252252251]
{"$rows_left_out":25}
{"sheet":"employees_formal","index":1,"n_rows":32,"n_cols":4,"rows_kept":32,"cut":false,"hidden":true,"merged":[]}
["country","year","mgr_college","employees"]
["Afghanistan",2009,null,32.146626499229541]
["Angola",2010,1,38.238244481221258]
["Argentina",2010,null,237.63443997185146]
["Bangladesh",2003,0.71161049604415894,297.68808290155442]
["Botswana",2010,1,78.507342071785274]
["Brazil",2003,0.65146356821060181,116.94798732274563]
["Burkina Faso",2009,1,88.911764786023056]
{"$rows_left_out":25}
{"sheet":"sales_informal","index":2,"n_rows":32,"n_cols":4,"rows_kept":32,"cut":false,"hidden":true,"merged":[]}
["country","year","va","sl"]
["Afghanistan",2009,37417.46484375,56870.99609375]
["Angola",2010,9905.80078125,15451.330078125]
["Argentina",2010,1937.626708984375,2502.443115234375]
["Bangladesh",2003,1584.25146484375,4101.22705078125]
["Botswana",2010,4230.01416015625,5576.23974609375]
["Brazil",2003,7901.8681640625,13373.4599609375]
["Burkina Faso",2009,19031.732421875,51907.58203125]
{"$rows_left_out":25}
{"sheet":"sales_formal","index":3,"n_rows":32,"n_cols":5,"rows_kept":32,"cut":false,"hidden":true,"merged":[]}
["country","year","va","sl","lc"]
["Afghanistan",2009,70515.7265625,100914.5859375,26419.962890625]
["Angola",2010,105458.203125,127400.90625,8185.15234375]
["Argentina",2010,43823.1015625,100241.1171875,23895.517578125]
["Bangladesh",2003,8530.8662109375,31860.330078125,4068.02001953125]
["Botswana",2010,30050.69921875,78107.9296875,14430.228515625]
["Brazil",2003,27568.14453125,71770.03125,17825.99609375]
["Burkina Faso",2009,121129.2578125,148168.578125,17276.28125]
{"$rows_left_out":25}
{"sheet":"Table 1","index":4,"n_rows":217,"n_cols":9,"rows_kept":217,"cut":false,"hidden":true,"merged":[[192,0,193,0],[188,0,188,8],[189,0,189,8],[0,2,0,6],[191,2,191,6],[192,4,193,4],[192,1,193,1],[192,5,193,5]]}
[null,null,"Measure of Informality"]
["country","gdp_pc_ppp","inf_wef","tax_evasion","self_emp_pct","non_agric_self","inf_elec","inf_schneider","register_pop"]
["Tanzania",573.72726999999998,35,38.981349999999999,8.4,".",".",59.04,1.537585]
["Malawi",599.18182000000002,36,30.741800000000001,84.6,".",".",41.64,0.41736600000000001]
["Sierra Leone",623.90908999999999,".",".",".",".",".",43.36,"."]
["Congo, Dem. Rep.",666.09091000000001,".",37.637169999999998,".",52,".",49.54,"."]
["Burundi",668.90908999999999,34,15.668519999999999,".",36,".",38.46,"."]
["Niger",721.63635999999997,".",13.09259,".",".",".",43.32,"."]
{"$rows_left_out":210}
{"sheet":"Table 2","index":5,"n_rows":43,"n_cols":45,"rows_kept":43,"cut":false,"hidden":true,"merged":[[0,0,0,15],[2,0,2,15],[4,11,4,12],[4,13,4,14],[3,4,4,4],[3,5,3,8],[3,9,4,10],[22,0,22,15],[23,2,23,4],[23,5,23,8],[24,9,24,10],[24,11,24,12],[24,13,24,14]]}
["Table 2.  Obstacles to Doing Business"]
[]
[]
[null,null,null,null,"Informal Survey","Enterprise Survey",null,null,null,"Enterprise vs Informal"]
[null,"STATA Label","Unregistered","Registered",null,"Small","Medium","Big","All",null,null,"Registered vs Unregistered",null,"Small vs Unregistered",null,"Big vs Small"]
["Obstacles (% of firms identifying an obstacle as the most important)"]
["Access to Financing","access_fin",0.43833732604980469,"",0.43833732604980469,0.20607545971870422,0.17771126329898834,0.13567635416984558,0.18545517325401306,-0.25288215279579163,"a","","",-0.23226186633110046,"a",-7.0399105548858643E-2]
["Political instability","instability",0.11397167295217514,"",0.11397167295217514,9.4690680503845215E-2,9.0565800666809082E-2,0.11727560311555862,9.7447171807289124E-2,-1.6524501144886017E-2,"","","",-1.9280992448329926E-2,"",2.2584922611713409E-2]
{"$rows_left_out":36}
{"sheet":"Table 3","index":6,"n_rows":242,"n_cols":5,"rows_kept":242,"cut":false,"hidden":true,"merged":[[0,0,0,4],[1,0,1,4],[3,1,3,4]]}
["Table 3:  Regional Human Capital, the size of establishments, and participation in the economy"]
["The table reports fixed effect regressions for for the following three dependent variables: (1) logarithm of the number of employees per establishment; (3) logarithm of the number of employees per capita; and (4) logarithm of the number of employees working in firms that employ at least 100 employees as a percent of total employment.   All regressions include the number of years of education.  "]
[]
["","Dependent Variable:"]
["","Ln(Establishments/Population)","Ln(Employees/Establishments)","Ln(Employees/Population)","Ln(Employees Big Firms/Employees)"]
[]
["Years of Education in the Region","0.2936a","0.1205a","0.3372a","0.2215a"]
["","(0.0311)","(0.0220)","(0.0263)","(0.0349)"]
{"$rows_left_out":235}
{"sheet":"ONLINE APPENDIX -- Tables","index":7,"n_rows":4,"n_cols":2,"rows_kept":4,"cut":false,"hidden":false,"merged":[[0,0,0,3]]}
["Index"]
[1,"Value added and employment"]
[{"$f":"A2+1","v":2},"Costs and benefits of registering"]
[{"$f":"A3+1","v":3},"Figure 5 regression"]

{"sheet":"Value added and employment","index":8,"n_rows":32,"n_cols":13,"rows_kept":32,"cut":false,"hidden":false,"merged":[[0,0,0,12],[2,2,2,3],[2,4,2,5],[2,6,2,7],[2,8,2,9]]}
["Online Appendix Table 1:  Value Added and Employment of Informal and Formal Firms"]
[]
[null,null,"Value Added per Worker",null,"Sales",null,"Employment",null,"% Top Manager College",null,null,null,"Value Added per Worker"]
["Country","Year","Informal","Formal","Informal","Formal","Informal","Formal","Informal","Formal",null,null,"Informal/Formal"]
["Afghanistan",2009,{"$f":"INDEX(sales_informal!$A$2:$D$28,MATCH(1,(sales_informal!$A$2:$A$28=A5)*(sales_informal!$B$2:$B$28=B5),0),3)","v":37417.46484375},{"$f":"INDEX(sales_formal!$A$2:$D$28,MATCH(1,(sales_formal!$A$2:$A$28=A5)*(sales_formal!$B$2:$B$28=B5),0),3)","v":70515.7265625},61790.859375,102899.5625,{"$f":"INDEX(employees_inf!$A$2:$D$28,MATCH(1,(employees_inf!$A$2:$A$28=A5)*(employees_inf!$B$2:$B$28=B5),0),4)","v":9.5957446808510642},{"$f":"INDEX(employees_formal!$A$2:$D$28,MATCH(1,(employees_formal!$A$2:$A$28=A5)*(employees_formal!$B$2:$B$28=B5),0),4)","v":32.146626499229541},".",".",null,null,{"$f":"C5/D5","v":0.53062581452076352}]
["Angola",2010,{"$f":"INDEX(sales_informal!$A$2:$D$28,MATCH(1,(sales_informal!$A$2:$A$28=A6)*(sales_informal!$B$2:$B$28=B6),0),3)","v":9905.80078125},{"$f":"INDEX(sales_formal!$A$2:$D$28,MATCH(1,(sales_formal!$A$2:$A$28=A6)*(sales_formal!$B$2:$B$28=B6),0),3)","v":105458.203125},15424.154296875,105369.5078125,{"$f":"INDEX(employees_inf!$A$2:$D$28,MATCH(1,(employees_inf!$A$2:$A$28=A6)*(employees_inf!$B$2:$B$28=B6),0),4)","v":9.2183908045977017},{"$f":"INDEX(employees_formal!$A$2:$D$28,MATCH(1,(employees_formal!$A$2:$A$28=A6)*(employees_formal!$B$2:$B$28=B6),0),4)","v":38.238244481221258},".",1,null,null,{"$f":"C6/D6","v":9.3931059772643932E-2}]
["Argentina",2010,{"$f":"INDEX(sales_informal!$A$2:$D$28,MATCH(1,(sales_informal!$A$2:$A$28=A7)*(sales_informal!$B$2:$B$28=B7),0),3)","v":1937.626708984375},{"$f":"INDEX(sales_formal!$A$2:$D$28,MATCH(1,(sales_formal!$A$2:$A$28=A7)*(sales_formal!$B$2:$B$28=B7),0),3)","v":43823.1015625},2472.904052734375,96826.34375,{"$f":"INDEX(employees_inf!$A$2:$D$28,MATCH(1,(employees_inf!$A$2:$A$28=A7)*(employees_inf!$B$2:$B$28=B7),0),4)","v":1.5825242718446602},{"$f":"INDEX(employees_formal!$A$2:$D$28,MATCH(1,(employees_formal!$A$2:$A$28=A7)*(employees_formal!$B$2:$B$28=B7),0),4)","v":237.63443997185146},".",".",null,null,4.4214732410506233E-2]
["Bangladesh",2003,{"$f":"INDEX(sales_informal!$A$2:$D$28,MATCH(1,(sales_informal!$A$2:$A$28=A8)*(sales_informal!$B$2:$B$28=B8),0),3)","v":1584.25146484375},{"$f":"INDEX(sales_formal!$A$2:$D$28,MATCH(1,(sales_formal!$A$2:$A$28=A8)*(sales_formal!$B$2:$B$28=B8),0),3)","v":8530.8662109375},4000.831298828125,28002.572265625,{"$f":"INDEX(employees_inf!$A$2:$D$28,MATCH(1,(employees_inf!$A$2:$A$28=A8)*(employees_inf!$B$2:$B$28=B8),0),4)","v":5.2385786802030454},{"$f":"INDEX(employees_formal!$A$2:$D$28,MATCH(1,(employees_formal!$A$2:$A$28=A8)*(employees_formal!$B$2:$B$28=B8),0),4)","v":297.68808290155442},4.5685280114412308E-2,0.71161049604415894,null,null,0.1857081597191815]
{"$rows_left_out":25}
{"sheet":"Costs and Benefits Registering","index":9,"n_rows":15,"n_cols":19,"rows_kept":15,"cut":false,"hidden":false,"merged":[[0,0,0,8],[1,0,1,8],[2,0,2,8]]}
["Online Appendix Table 2: Costs and benefits of registering"]
[]
["Percentage of Informal Survey respondents rating the following as either the most important or second most important benefit that their firm could obtain from registering"]
[null,"Better access to financing","Better access to raw materials","Better access to markets","Less bribes to pay","Better opportunities with formal firms","More access to government programs or services","Better legal foundations on the property","Better access to infrastructure service"]
["Angola 2010",{"$f":"VALUE(L5)","v":0.71428573129999995},0.3613445461,7.5630254999999993E-2,9.2436976700000006E-2,3.3613447099999999E-2,1.6806723499999999E-2,0.12605042759999999,1.6806723499999999E-2,"AGO2010","AGO2010",0.71428573129999995,0.3613445461,7.5630254999999993E-2,9.2436976700000006E-2,3.3613447099999999E-2,1.6806723499999999E-2,0.12605042759999999,1.6806723499999999E-2]
["Burkina Faso 2009",0.63247865439999995,0.26890757679999999,0.12820513550000001,0.26271185279999998,5.1282052000000002E-2,7.6923079800000002E-2,2.5641026000000001E-2,1.7094017900000001E-2,"BFA2009","BFA2009",0.63247865439999995,0.26890757679999999,0.12820513550000001,0.26271185279999998,5.1282052000000002E-2,7.6923079800000002E-2,2.5641026000000001E-2,1.7094017900000001E-2]
["Botswana 2010",1,1.12359552E-2,0.17977528270000001,1.12359552E-2,8.9887641399999996E-2,6.7415729199999996E-2,2.2471910300000002E-2,6.7415729199999996E-2,"BTW2010","BTW2010",1,1.12359552E-2,0.17977528270000001,1.12359552E-2,8.9887641399999996E-2,6.7415729199999996E-2,2.2471910300000002E-2,6.7415729199999996E-2]
["Cameroon 2009",0.67213112119999996,0.38524588939999999,0.18032786249999999,0.32786884900000002,0.13114753370000001,2.45901644E-2,6.5573766800000002E-2,1.6393441700000001E-2,"CMR2009","CMR2009",0.67213112119999996,0.38524588939999999,0.18032786249999999,0.32786884900000002,0.13114753370000001,2.45901644E-2,6.5573766800000002E-2,1.6393441700000001E-2]
{"$rows_left_out":8}
{"sheet":"Regression for Figure 5","index":10,"n_rows":215,"n_cols":2,"rows_kept":215,"cut":false,"hidden":false,"merged":[[0,0,0,1],[2,0,2,1]]}
["Online Appendix:  Figure 5 Regression"]
[]
["Dependent Variable is Change in self-employment"]
["ln(GDP per capitat / GDP per capitat-1)","-7.1482a"]
[{"$f":"\"\"","v":""},{"$f":"\"(1.4772)\"","v":"(1.4772)"}]
[]
["ln(Labor forcet / Labor forcet-1)","10.6441a"]
[{"$f":"\"\"","v":""},{"$f":"\"(3.6289)\"","v":"(3.6289)"}]
{"$rows_left_out":208}
{"sheet":"ONLINE APPENDIX -- Data","index":11,"n_rows":7,"n_cols":2,"rows_kept":7,"cut":false,"hidden":false,"merged":[[0,0,0,2]]}
["Index"]
[1,"Data Table 1"]
[{"$f":"A2+1","v":2},"Data Table 3"]
[{"$f":"A3+1","v":3},"Data Figures 1-3"]
[4,"Data Figure 4"]
[5,"Data Figure 5"]
[6,"Data Figure 6"]

{"sheet":"Data Table 1","index":12,"n_rows":187,"n_cols":9,"rows_kept":187,"cut":false,"hidden":false,"merged":[[0,4,1,4],[0,1,1,1],[0,5,1,5]]}
[null,"GDP/Population","% GDP Informal","% Tax Evasion","% Self-employment","% Self-employment non-agriculture","% GDP Informal","% GDP Informal","Registered firms /"]
["country",null,"(World Economic Forum)","(Enterprise survey)",null,null,"(electricity consumption)","(multiple indicators)","population (000s)"]
["Tanzania",573.72726999999998,35,38.981349999999999,8.4,".",".",59.04,1.537585]
["Malawi",599.18182000000002,36,30.741800000000001,84.6,".",".",41.64,0.41736600000000001]
["Sierra Leone",623.90908999999999,".",".",".",".",".",43.36,"."]
["Congo, Dem. Rep.",666.09091000000001,".",37.637169999999998,".",52,".",49.54,"."]
["Burundi",668.90908999999999,34,15.668519999999999,".",36,".",38.46,"."]
["Niger",721.63635999999997,".",13.09259,".",".",".",43.32,"."]
{"$rows_left_out":180}
{"sheet":"Data Table 3","index":13,"n_rows":1095,"n_cols":9,"rows_kept":1095,"cut":false,"hidden":false,"merged":[[0,2,0,5]]}
["",null,"Dependent Variable:"]
["Country","Region","Ln(Establishments/Population)","Ln(Employees/Establishments)","Ln(Employees/Population)","Ln(Employees Big Firms/Employees)","Years of education"]
["United Arab Emirates","ARE","Abu Dhabi",-3.956483,2.3256230000000002,-1.63086,7.0641069999999999]
["United Arab Emirates","ARE","Ajman",-3.5246179999999998,1.6625110000000001,-1.8621080000000001,7.3838140000000001]
["United Arab Emirates","ARE","Dubai",-3.777879,2.2967369999999998,-1.481141,8.4970859999999995]
["United Arab Emirates","ARE","Fujairah",-3.653635,1.4252849999999999,-2.2283499999999998,6.6785680000000003]
["United Arab Emirates","ARE","Ras al-Khaimah",-3.4730810000000001,1.3762430000000001,-2.096838,6.6806380000000001]
["United Arab Emirates","ARE","Sharjah",-3.73244,1.9077919999999999,-1.824648,8.2787679999999995]
{"$rows_left_out":1088}
{"sheet":"Data Figures 1 -3","index":14,"n_rows":28,"n_cols":7,"rows_kept":28,"cut":false,"hidden":false,"merged":[]}
["Country","Top Manager Informal has College","Top Manager Formal has College","Value Added Informal","Value Added Formall","Value Added Small Formall","Fraction VA Informal / Formal"]
["Afghanistan",".",".",37417.46484375,70515.7265625,63195.59765625,0.53062581452076352]
["Angola",".",1,9905.80078125,105458.203125,179706.28125,9.3931059772643932E-2]
["Argentina",".",".",1937.626708984375,43823.1015625,30498.685546875,4.4214732410506233E-2]
["Bangladesh",4.5685280114412308E-2,0.71161049604415894,1584.25146484375,8530.8662109375,null,0.1857081597191815]
["Botswana",".",1,4230.01416015625,30050.69921875,16595.58984375,0.14076258689904131]
["Brazil",0.127976194024086,0.65146356821060181,7901.8681640625,27568.14453125,15746.8232421875,0.28663039527761108]
["Burkina Faso",3.6036036908626556E-2,1,19031.732421875,121129.2578125,63199.73046875,0.15711920278860167]
{"$rows_left_out":21}
{"sheet":"Data Figure 4","index":15,"n_rows":176,"n_cols":4,"rows_kept":176,"cut":false,"hidden":false,"merged":[]}
["CountryName","CountryCode","self employment","gdp per capita (ny_gdp_pcap_pp_kd)"]
["Aruba","ABW",8.8999995999999992,36016.5]
["Angola","AGO",79.199996999999996,7345.68]
["Albania","ALB",56.299999,9243.3700000000008]
["United Arab Emirates","ARE",4.4000000999999997,57044.6]
["Argentina","ARG",23]
["Armenia","ARM",30.4,7290.64]
["American Samoa","ASM",3.5]
{"$rows_left_out":169}
{"sheet":"Data Figure 5","index":16,"n_rows":1521,"n_cols":9,"rows_kept":1521,"cut":false,"hidden":false,"merged":[]}
["CountryCode","CountryName","year","self employment","Δ self employment","gdp per capita (ny_gdp_pcap_pp_kd)","Growth gdp per capita ","Labor Force","Growth Labor Force"]
["AUS","Australia",1990,15.1,null,28335.3,null,8500000]
["AUS","Australia",1991,15.7,0.59999939999999996,27878.3,-1.6262100000000002E-2,8500000,5.3812E-3]
["AUS","Australia",1992,16.100000000000001,0.40000059999999998,27660,-7.8601999999999995E-3,8600000,8.8506000000000001E-3]
["AUS","Australia",1993,16.5,0.39999960000000001,28516.7,3.05023E-2,8700000,6.1060000000000003E-3]
["AUS","Australia",1994,15.9,-0.60000039999999999,29358.799999999999,2.9101399999999999E-2,8800000,1.84519E-2]
["AUS","Australia",1995,15.4,-0.5,30163.5,2.70414E-2,9000000,2.5597100000000001E-2]
["AUS","Australia",1996,15.1,-0.29999920000000002,30958.7,2.6020999999999999E-2,9200000,1.23552E-2]
{"$rows_left_out":1514}
{"sheet":"Data Figure 6","index":17,"n_rows":97,"n_cols":31,"rows_kept":97,"cut":false,"hidden":false,"merged":[]}
[null,"selfemp","employee","employer","fsize_sml","fsize_med","fsize_lrg","fsize_num","frml_registr","frml_account","frml_pension","inc","inc_emplr","inc_empee","inc_selfemp",null,null,null,null,null,null,null,null,null,null,"inc","inc_emplr",null,"inc_empee","inc_selfemp","gdppc_const05usd"]
["year","Self-employed","Employees","Employers","Small firms [1-99 employees]","Medium firms [100-499 employees]","Large firms [500+ employees]","Average firm size","Working population in formally registered firms or self-employment","Working population in firms or self-employment with formal accounting","Working population affiliated with pension system","Total annual income","Total annual income, employers","Total annual income, employees","Total annual income, self-employed","GDP per capita, PPP (constant 2005 international $)","Foreign direct investment, net inflows (% of GDP)","Agriculture, value added (% of GDP)","Industry, value added (% of GDP)","Services, etc., value added (% of GDP)","Total natural resources rents (% of GDP)","Manufacturing, value added (% of GDP)","GDP in current PEN","GDP in constant 2005 USD","exchange: 2005 USD / current LCU","Total annual income","Total annual income, employers","year","Total annual income, employees","Total annual income, self-employed","GDP per capita"]
[1998,0.51161116361617998,0.348208338022232,0.140180483460426,0.92764067649841297,3.8682661950588199E-2,3.3676650375127799E-2,103.065422058105,null,null,null,7012.146484375,12962.0732421875,7058.20654296875,5047.99853515625,5474.0514088542895,2.8967409100089801E-2,8.9775548503084793E-2,0.29693374211756901,0.61329070937934604,1.1017867322059999E-2,0.15732286275593999,166300000000,62230000000,0.37425330000000001,{"$f":"L3*$Y3","v":2624.3189618607421},4851.0986857303715,1998,{"$f":"N3*$Y3","v":2641.5570907876468},{"$f":"O3*$Y3","v":1889.2301101773926},2468.8462]
[1999,0.5264533162117,0.37342333793640098,0.100123360753059,0.944835186004639,0,5.5164810270071002E-2,37.159801483154297,null,null,4.75113019347191E-2,6194.6396484375,6891.1005859375,7308.91650390625,5172.9033203125,5436.80999192939,3.76631151007236E-2,8.7562360537043513E-2,0.295551817415523,0.61688582204743303,1.543815398957E-2,0.15347338264708699,174400000000,62800000000,0.36005090000000001,2230.3855805956055,2481.1469679573243,{"$f":"AB3+1","v":1999},2631.5819652562991,1862.508496091504,2452.0500000000002]
[2000,0.58932882547378496,0.30874675512313798,0.101924434304237,0.94821178913116499,0,5.1788203418254901E-2,183.86972045898401,null,null,9.8368376493453993E-2,6747.1435546875,11555.4052734375,8427.0673828125,4769.30517578125,5513.5717792593196,1.5194048217715901E-2,8.4991609467767001E-2,0.29894080529686201,0.61606758523537097,2.5756331029100001E-2,0.15809599691771301,186100000000,64650000000,0.3473367,2343.530576711426,4013.6163348383789,{"$f":"AB4+1","v":2000},2927.0297754237304,1656.5547210487794,2486.6702]
[2001,0.55274134874343905,0.30267238616943398,0.14458630979061099,0.91281992197036699,5.4315850138664197E-2,3.28641980886459E-2,62.0310249328613,null,null,0.110260061919689,6868.74755859375,10701.35546875,7268.666015625,5474.05712890625,5447.4221100246295,2.1215237888527597E-2,8.2492495560306606E-2,0.29578790030674101,0.62171960413295202,1.8392422492600001E-2,0.16003356046658901,189200000000,64790000000,0.34243240000000003,2352.0817114833985,3664.4908364171879,2001,2489.0267485289064,1874.4945203884768,2456.8361]
[2002,0.66610270738601696,0.24326378107070901,9.0633504092693301E-2,0.89206534624099698,5.6154724210500703E-2,5.1779959350824398E-2,118.827827453613,0.12910278141498599,0.15352807939052601,6.2238916754722602E-2,6365.39599609375,9440.6767578125,7726.85888671875,5286.66845703125,5644.36750617488,3.7973366250448302E-2,7.8456582761417093E-2,0.30386130211900403,0.61768211511957904,1.686260719675E-2,0.16088658789673602,199600000000,68050000000,0.34082299999999999,2169.4733595766602,3217.5997746279295,2002,2633.4912263481442,1801.8182035307616,2545.6603]
[2003,0.689991354942322,0.22520622611045801,8.4802418947219904E-2,0.88533878326416005,5.43828755617142E-2,6.0278315097093603E-2,168.894119262695,0.115454256534576,0.14893595874309501,7.8140415251254994E-2,6338.16357421875,10401.9580078125,8508.91015625,4937.326171875,5797.4783423377403,2.1761668114142697E-2,7.6319265188632399E-2,0.30831133903273,0.61536939577863703,2.2403933265099998E-2,0.15694416525827401,213400000000,70790000000,0.33168130000000001,2102.2503339095215,3450.1349545766602,2003,2822.2463822082032,1637.6187632115234,2614.7145999999998]
{"$rows_left_out":89}